{"text_format":"3","workbook":"xlsx","n_sheets":4,"sheets":["Formulaire","Ne Pas toucher ","liste","menu déroulant"],"not_rendered":{"defined_names":44},"read":"whole","date_system":"1900"}

{"sheet":"Formulaire","index":0,"n_rows":8,"n_cols":9,"rows_kept":8,"merged":[[4,1,4,2],[6,4,6,8]]}
["Nom : ","xxx",null,"Recommandations importantes :"]
["Prénom :","xxx",null,"·        Si vous souhaitez réserver pour plusieurs jours, merci de remplir plusieurs formulaires"]
["N°lecteur : ","xxx",null,"·        Vous ne pouvez réserver que 10 cotes différentes maximum par jour"]
[{"$nulls":3},"·        Le créneau de consultation est de 14h à 18h"]
["Date de réservation","xxx"]
[]
["Cases à remplir par le lecteur (maximum 10 cotes par jour demandées)",{"$nulls":3},"Cases à remplir par le personnel de la BLJD"]
["Titre","Auteur","Date / Tomaison","Cote","Localisation","Autorisation de consultation nécessaire ?","Autorisation de consultation reçue ?","Autorisation de prise de vue","Prélèvement"]

{"sheet":"Ne Pas toucher ","index":1,"n_rows":510,"n_cols":5,"rows_kept":510,"merged":[[0,2,0,3],[0,4,0,5],[1,0,1,5],[3,0,4,0],[3,1,4,5],[5,1,5,5],[6,0,7,0],[6,1,7,5],[8,0,9,0],[8,1,9,5],[10,0,10,2],[11,1,11,2],[12,1,12,2],[17,4,17,5],[18,0,18,5],[20,0,21,0],[20,1,21,5],[22,1,22,5],[23,0,24,0],[23,1,24,5],[25,1,25,5],[27,0,27,2],[28,1,28,2],[29,1,29,2],[34,4,34,5],[35,0,35,5],[37,0,38,0],[37,1,38,5],[39,1,39,5],[40,0,41,0],[40,1,41,5],[42,1,42,5],[44,0,44,2],[45,1,45,2],[46,1,46,2],[51,1,51,2],[51,4,51,5],[52,0,52,5],[54,0,55,0],[54,1,55,5],[56,1,56,5],[57,0,58,0],[57,1,58,5],[59,1,59,5],[61,0,61,2],[62,1,62,2],[63,1,63,2],[68,1,68,2],[68,4,68,5],[69,0,69,5],[71,0,72,0],[71,1,72,5],[73,1,73,5],[74,0,75,0],[74,1,75,5],[76,1,76,5],[78,0,78,2],[79,1,79,2],[80,1,80,2],[85,1,85,2],[85,4,85,5],[86,0,86,5],[88,0,89,0],[88,1,89,5],[90,1,90,5],[91,0,92,0],[91,1,92,5],[93,1,93,5],[95,0,95,2],[96,1,96,2],[97,1,97,2],[102,1,102,2],[102,4,102,5],[103,0,103,5],[105,0,106,0],[105,1,106,5],[107,1,107,5],[108,0,109,0],[108,1,109,5],[110,1,110,5],[112,0,112,2],[113,1,113,2],[114,1,114,2],[119,1,119,2],[119,4,119,5],[120,0,120,5],[122,0,123,0],[122,1,123,5],[124,1,124,5],[125,0,126,0],[125,1,126,5],[127,1,127,5],[129,0,129,2],[130,1,130,2],[131,1,131,2],[136,1,136,2],[136,4,136,5],[137,0,137,5],[139,0,140,0],[139,1,140,5],[141,1,141,5],[142,0,143,0],[142,1,143,5],[146,0,146,2],[147,1,147,2],[148,1,148,2],[153,1,153,2],[153,4,153,5],[156,0,157,0],[156,1,157,5],[158,1,158,5],[159,0,160,0],[159,1,160,5],[161,1,161,5],[163,0,163,2],[164,1,164,2],[165,1,165,2],[170,1,170,2],[170,4,170,5],[171,0,171,5],[173,0,174,0],[173,1,174,5],[175,1,175,5],[176,0,177,0],[176,1,177,5],[178,1,178,5],[180,0,180,2],[181,1,181,2],[182,1,182,2],[187,1,187,2],[187,4,187,5],[188,0,188,5],[190,0,191,0],[190,1,191,5],[192,1,192,5],[193,0,194,0],[193,1,194,5],[195,1,195,5],[197,0,197,2],[198,1,198,2],[199,1,199,2],[204,1,204,2],[204,4,204,5],[205,0,205,5],[207,0,208,0],[207,1,208,5],[209,1,209,5],[210,0,211,0],[210,1,211,5],[212,1,212,5],[214,0,214,2],[215,1,215,2],[216,1,216,2],[221,1,221,2],[221,4,221,5],[222,0,222,5],[224,0,225,0],[224,1,225,5],[226,1,226,5],[227,0,228,0],[227,1,228,5],[229,1,229,5],[231,0,231,2],[232,1,232,2],[233,1,233,2],[238,1,238,2],[238,4,238,5],[239,0,239,5],[241,0,242,0],[241,1,242,5],[243,1,243,5],[244,0,245,0],[244,1,245,5],[246,1,246,5],[248,0,248,2],[249,1,249,2],[250,1,250,2],[255,1,255,2],[255,4,255,5],[256,0,256,5],[258,0,259,0],[258,1,259,5],[260,1,260,5],[261,0,262,0],[261,1,262,5],[263,1,263,5],[265,0,265,2],[266,1,266,2],[267,1,267,2],[272,1,272,2],[272,4,272,5],[273,0,273,5],[275,0,276,0],[275,1,276,5],[277,1,277,5],[278,0,279,0],[278,1,279,5],[280,1,280,5],[282,0,282,2],[283,1,283,2],[284,1,284,2],[289,1,289,2],[289,4,289,5],[290,0,290,5],[292,0,293,0],[292,1,293,5],[294,1,294,5],[295,0,296,0],[295,1,296,5],[297,1,297,5],[299,0,299,2],[300,1,300,2],[301,1,301,2],[306,1,306,2],[306,4,306,5],[307,0,307,5],[309,0,310,0],[309,1,310,5],[311,1,311,5],[312,0,313,0],[312,1,313,5],[314,1,314,5],[316,0,316,2],[317,1,317,2],[318,1,318,2],[323,1,323,2],[323,4,323,5],[324,0,324,5],[326,0,327,0],[326,1,327,5],[328,1,328,5],[329,0,330,0],[329,1,330,5],[331,1,331,5],[333,0,333,2],[334,1,334,2],[335,1,335,2],[340,1,340,2],[340,4,340,5],[343,0,344,0],[343,1,344,5],[345,1,345,5],[346,0,347,0],[346,1,347,5],[348,1,348,5],[350,0,350,2],[351,1,351,2],[352,1,352,2],[357,1,357,2],[357,4,357,5],[358,0,358,5],[360,1,361,5],[362,1,362,5],[363,0,364,0],[363,1,364,5],[365,1,365,5],[367,0,367,2],[368,1,368,2],[369,1,369,2],[374,1,374,2],[374,4,374,5],[375,0,375,5],[377,0,378,0],[377,1,378,5],[379,1,379,5],[380,0,381,0],[380,1,381,5],[382,1,382,5],[384,0,384,2],[385,1,385,2],[386,1,386,2],[391,1,391,2],[391,4,391,5],[392,0,392,5],[394,1,395,5],[396,1,396,5],[397,1,398,5],[399,1,399,5],[401,0,401,2],[402,1,402,2],[403,1,403,2],[408,1,408,2],[408,4,408,5],[409,0,409,5],[411,0,412,0],[411,1,412,5],[413,1,413,5],[414,0,415,0],[414,1,415,5],[416,1,416,5],[418,0,418,2],[419,1,419,2],[420,1,420,2],[425,1,425,2],[425,4,425,5],[426,0,426,5],[428,0,429,0],[428,1,429,5],[430,1,430,5],[431,0,432,0],[431,1,432,5],[433,1,433,5],[435,0,435,2],[436,1,436,2],[437,1,437,2],[442,1,442,2],[442,4,442,5],[443,0,443,5],[445,0,446,0],[445,1,446,5],[447,1,447,5],[448,0,449,0],[448,1,449,5],[450,1,450,5],[452,0,452,2],[453,1,453,2],[454,1,454,2],[459,1,459,2],[459,4,459,5],[460,0,460,5],[462,0,463,0],[462,1,463,5],[464,1,464,5],[465,0,466,0],[465,1,466,5],[467,1,467,5],[469,0,469,2],[470,1,470,2],[471,1,471,2],[476,1,476,2],[476,4,476,5],[477,0,477,5],[479,0,480,0],[479,1,480,5],[481,1,481,5],[482,0,483,0],[482,1,483,5],[484,1,484,5],[486,0,486,2],[487,1,487,2],[488,1,488,2],[493,1,493,2],[493,4,493,5],[494,0,494,5],[496,0,497,0],[496,1,497,5],[498,1,498,5],[499,0,500,0],[499,1,500,5],[501,1,501,5],[503,0,503,2],[504,1,504,2],[505,1,505,2]]}
["Date:",{"$f":"TODAY()","v":"2026-03-12"},"Localisation :",null,{"$f":"IF(ISBLANK(Formulaire!$E$9),\"\",Formulaire!$E$9)","v":""}]
["Demande de document 1-1"]
[]
["Cote : ",{"$f":"IF(ISBLANK(Formulaire!D9),\"\",Formulaire!D9)","v":""}]
[]
["Auteur: ",{"$f":"IF(ISBLANK(Formulaire!B9),\"\",Formulaire!B9)","v":""}]
["Titre :",{"$f":"IF(ISBLANK(Formulaire!A9),\"\",Formulaire!A9)","v":""}]
[]
["Date / tomaison :",{"$f":"IF(ISBLANK(Formulaire!C9),\"\",Formulaire!C9)","v":""}]
[]
["Lecteur",null,null,"Commentaire :"]
["Nom : ",{"$f":"IF(ISBLANK(Formulaire!$B$1),\"\",Formulaire!$B$1)","v":"xxx"}]
["Prénom :",{"$f":"IF(ISBLANK(Formulaire!$B$2),\"\",Formulaire!$B$2)","v":"xxx"}]
[]
["Motif de non communication :"]
["Manque en place",null,null,"Indisponible"]
["Conservation",null,null,"Copie numérique"]
["Date",{"$f":"TODAY()","v":"2026-03-12"},null,"Localisation :",{"$f":"IF(ISBLANK(Formulaire!$E$9),\"\",Formulaire!$E$9)","v":""}]
["Demande de document 1-2"]
[]
["Cote : ",{"$f":"IF(ISBLANK(Formulaire!$D$9),\"\",Formulaire!$D$9)","v":""}]
[]
["Auteur: ",{"$f":"IF(ISBLANK(Formulaire!$B$9),\"\",Formulaire!$B$9)","v":""}]
["Titre :",{"$f":"IF(ISBLANK(Formulaire!$A$9),\"\",Formulaire!$A$9)","v":""}]
[]
["Date / tomaison :",{"$f":"IF(ISBLANK(Formulaire!$C$9),\"\",Formulaire!$C$9)","v":""}]
[]
["Lecteur",null,null,"Commentaire :"]
["Nom : ",{"$f":"IF(ISBLANK(Formulaire!$B$1),\"\",Formulaire!$B$1)","v":"xxx"}]
["Prénom :",{"$f":"IF(ISBLANK(Formulaire!$B$2),\"\",Formulaire!$B$2)","v":"xxx"}]
[]
["Motif de non communication :"]
["Manque en place",null,null,"Indisponible"]
["Conservation",null,null,"Copie numérique"]
["Date",{"$f":"TODAY()","v":"2026-03-12"},null,"Localisation :",{"$f":"IF(ISBLANK(Formulaire!$E$9),\"\",Formulaire!$E$9)","v":""}]
["Demande de document 1-3"]
[]
["Cote : ",{"$f":"IF(ISBLANK(Formulaire!$D$9),\"\",Formulaire!$D$9)","v":""}]
[]
["Auteur: ",{"$f":"IF(ISBLANK(Formulaire!$B$9),\"\",Formulaire!$B$9)","v":""}]
["Titre :",{"$f":"IF(ISBLANK(Formulaire!$A$9),\"\",Formulaire!$A$9)","v":""}]
[]
["Date / tomaison :",{"$f":"IF(ISBLANK(Formulaire!$C$9),\"\",Formulaire!$C$9)","v":""}]
[]
["Lecteur",null,null,"Commentaire :"]
["Nom : ",{"$f":"IF(ISBLANK(Formulaire!$B$1),\"\",Formulaire!$B$1)","v":"xxx"}]
["Prénom :",{"$f":"IF(ISBLANK(Formulaire!$B$2),\"\",Formulaire!$B$2)","v":"xxx"}]
[]
["Motif de non communication :"]
["Manque en place",null,null,"Indisponible"]
["Conservation",null,null,"Copie numérique"]
["Date",{"$f":"TODAY()","v":"2026-03-12"},null,"Localisation :",{"$f":"IF(ISBLANK(Formulaire!$E$10),\"\",Formulaire!$E$10)","v":""}]
["Demande de document 2-1"]
[]
["Cote : ",{"$f":"IF(ISBLANK(Formulaire!$D$10),\"\",Formulaire!$D$10)","v":""}]
[]
["Auteur: ",{"$f":"IF(ISBLANK(Formulaire!$B$10),\"\",Formulaire!$B$10)","v":""}]
["Titre :",{"$f":"IF(ISBLANK(Formulaire!$A$10),\"\",Formulaire!$A$10)","v":""}]
[]
["Date / tomaison :",{"$f":"IF(ISBLANK(Formulaire!$C$10),\"\",Formulaire!$C$10)","v":""}]
[]
["Lecteur",null,null,"Commentaire :"]
["Nom : ",{"$f":"IF(ISBLANK(Formulaire!$B$1),\"\",Formulaire!$B$1)","v":"xxx"}]
["Prénom :",{"$f":"IF(ISBLANK(Formulaire!$B$2),\"\",Formulaire!$B$2)","v":"xxx"}]
[]
["Motif de non communication :"]
["Manque en place",null,null,"Indisponible"]
["Conservation",null,null,"Copie numérique"]
["Date",{"$f":"TODAY()","v":"2026-03-12"},null,"Localisation :",{"$f":"IF(ISBLANK(Formulaire!$E$10),\"\",Formulaire!$E$10)","v":""}]
["Demande de document 2-2"]
[]
["Cote : ",{"$f":"IF(ISBLANK(Formulaire!$D$10),\"\",Formulaire!$D$10)","v":""}]
[]
["Auteur: ",{"$f":"IF(ISBLANK(Formulaire!$B$10),\"\",Formulaire!$B$10)","v":""}]
["Titre :",{"$f":"IF(ISBLANK(Formulaire!$A$10),\"\",Formulaire!$A$10)","v":""}]
[]
["Date / tomaison :",{"$f":"IF(ISBLANK(Formulaire!$C$10),\"\",Formulaire!$C$10)","v":""}]
[]
["Lecteur",null,null,"Commentaire :"]
["Nom : ",{"$f":"IF(ISBLANK(Formulaire!$B$1),\"\",Formulaire!$B$1)","v":"xxx"}]
["Prénom :",{"$f":"IF(ISBLANK(Formulaire!$B$2),\"\",Formulaire!$B$2)","v":"xxx"}]
[]
["Motif de non communication :"]
["Manque en place",null,null,"Indisponible"]
["Conservation",null,null,"Copie numérique"]
["Date",{"$f":"TODAY()","v":"2026-03-12"},null,"Localisation :",{"$f":"IF(ISBLANK(Formulaire!$E$10),\"\",Formulaire!$E$10)","v":""}]
["Demande de document 2-3"]
[]
["Cote : ",{"$f":"IF(ISBLANK(Formulaire!$D$10),\"\",Formulaire!$D$10)","v":""}]
[]
["Auteur: ",{"$f":"IF(ISBLANK(Formulaire!$B$10),\"\",Formulaire!$B$10)","v":""}]
["Titre :",{"$f":"IF(ISBLANK(Formulaire!$A$10),\"\",Formulaire!$A$10)","v":""}]
[]
["Date / tomaison :",{"$f":"IF(ISBLANK(Formulaire!$C$10),\"\",Formulaire!$C$10)","v":""}]
[]
["Lecteur",null,null,"Commentaire :"]
["Nom : ",{"$f":"IF(ISBLANK(Formulaire!$B$1),\"\",Formulaire!$B$1)","v":"xxx"}]
["Prénom :",{"$f":"IF(ISBLANK(Formulaire!$B$2),\"\",Formulaire!$B$2)","v":"xxx"}]
[]
["Motif de non communication :"]
["Manque en place",null,null,"Indisponible"]
["Conservation",null,null,"Copie numérique"]
["Date",{"$f":"TODAY()","v":"2026-03-12"},null,"Localisation :",{"$f":"IF(ISBLANK(Formulaire!$E$11),\"\",Formulaire!$E$11)","v":""}]
["Demande de document 3-1"]
[]
["Cote : ",{"$f":"IF(ISBLANK(Formulaire!$D$11),\"\",Formulaire!$D$11)","v":""}]
[]
["Auteur: ",{"$f":"IF(ISBLANK(Formulaire!$B$11),\"\",Formulaire!$B$11)","v":""}]
["Titre :",{"$f":"IF(ISBLANK(Formulaire!$A$11),\"\",Formulaire!$A$11)","v":""}]
[]
["Date / tomaison :",{"$f":"IF(ISBLANK(Formulaire!$C$11),\"\",Formulaire!$C$11)","v":""}]
[]
["Lecteur",null,null,"Commentaire :"]
["Nom : ",{"$f":"IF(ISBLANK(Formulaire!$B$1),\"\",Formulaire!$B$1)","v":"xxx"}]
["Prénom :",{"$f":"IF(ISBLANK(Formulaire!$B$2),\"\",Formulaire!$B$2)","v":"xxx"}]
[]
["Motif de non communication :"]
[null,"Manque en place",null,"Indisponible"]
[null,"Conservation",null,"Copie numérique"]
["Date",{"$f":"TODAY()","v":"2026-03-12"},null,"Localisation :",{"$f":"IF(ISBLANK(Formulaire!$E$11),\"\",Formulaire!$E$11)","v":""}]
["Demande de document 3-2"]
[]
["Cote : ",{"$f":"IF(ISBLANK(Formulaire!$D$11),\"\",Formulaire!$D$11)","v":""}]
[]
["Auteur: ",{"$f":"IF(ISBLANK(Formulaire!$B$11),\"\",Formulaire!$B$11)","v":""}]
["Titre :",{"$f":"IF(ISBLANK(Formulaire!$A$11),\"\",Formulaire!$A$11)","v":""}]
[]
["Date / tomaison :",{"$f":"IF(ISBLANK(Formulaire!$C$11),\"\",Formulaire!$C$11)","v":""}]
[]
["Lecteur",null,null,"Commentaire :"]
["Nom : ",{"$f":"IF(ISBLANK(Formulaire!$B$1),\"\",Formulaire!$B$1)","v":"xxx"}]
["Prénom :",{"$f":"IF(ISBLANK(Formulaire!$B$2),\"\",Formulaire!$B$2)","v":"xxx"}]
[]
["Motif de non communication :"]
["Manque en place",null,null,"Indisponible"]
["Conservation",null,null,"Copie numérique"]
["Date",{"$f":"TODAY()","v":"2026-03-12"},null,"Localisation :",{"$f":"IF(ISBLANK(Formulaire!$E$11),\"\",Formulaire!$E$11)","v":""}]
["Demande de document 3-3"]
[]
["Cote : ",{"$f":"IF(ISBLANK(Formulaire!$D$11),\"\",Formulaire!$D$11)","v":""}]
[]
["Auteur: ",{"$f":"IF(ISBLANK(Formulaire!$B$11),\"\",Formulaire!$B$11)","v":""}]
["Titre :",{"$f":"IF(ISBLANK(Formulaire!$A$11),\"\",Formulaire!$A$11)","v":""}]
[]
["Date / tomaison :",{"$f":"IF(ISBLANK(Formulaire!$C$11),\"\",Formulaire!$C$11)","v":""}]
[]
["Lecteur",null,null,"Commentaire :"]
["Nom : ",{"$f":"IF(ISBLANK(Formulaire!$B$1),\"\",Formulaire!$B$1)","v":"xxx"}]
["Prénom :",{"$f":"IF(ISBLANK(Formulaire!$B$2),\"\",Formulaire!$B$2)","v":"xxx"}]
[]
["Motif de non communication :"]
["Manque en place",null,null,"Indisponible"]
["Conservation",null,null,"Copie numérique"]
["Date",{"$f":"TODAY()","v":"2026-03-12"},null,"Localisation :",{"$f":"IF(ISBLANK(Formulaire!$E$12),\"\",Formulaire!$E$12)","v":""}]
[null,null,"Demande de document 4-1"]
[]
["Cote : ",{"$f":"IF(ISBLANK(Formulaire!$D$12),\"\",Formulaire!$D$12)","v":""}]
[]
["Auteur: ",{"$f":"IF(ISBLANK(Formulaire!$B$12),\"\",Formulaire!$B$12)","v":""}]
["Titre :",{"$f":"IF(ISBLANK(Formulaire!$A$12),\"\",Formulaire!$A$12)","v":""}]
[]
["Date / tomaison :",{"$f":"IF(ISBLANK(Formulaire!$C$12),\"\",Formulaire!$C$12)","v":""}]
[]
["Lecteur",null,null,"Commentaire :"]
["Nom : ",{"$f":"IF(ISBLANK(Formulaire!$B$1),\"\",Formulaire!$B$1)","v":"xxx"}]
["Prénom :",{"$f":"IF(ISBLANK(Formulaire!$B$2),\"\",Formulaire!$B$2)","v":"xxx"}]
[]
["Motif de non communication :"]
[null,"Manque en place",null,"Indisponible"]
[null,"Conservation",null,"Copie numérique"]
["Date",{"$f":"TODAY()","v":"2026-03-12"},null,"Localisation :",{"$f":"IF(ISBLANK(Formulaire!$E$12),\"\",Formulaire!$E$12)","v":""}]
["Demande de document 4-2"]
[]
["Cote : ",{"$f":"IF(ISBLANK(Formulaire!$D$12),\"\",Formulaire!$D$12)","v":""}]
[]
["Auteur: ",{"$f":"IF(ISBLANK(Formulaire!$B$12),\"\",Formulaire!$B$12)","v":""}]
["Titre :",{"$f":"IF(ISBLANK(Formulaire!$A$12),\"\",Formulaire!$A$12)","v":""}]
[]
["Date / tomaison :",{"$f":"IF(ISBLANK(Formulaire!$C$12),\"\",Formulaire!$C$12)","v":""}]
[]
["Lecteur",null,null,"Commentaire :"]
["Nom : ",{"$f":"IF(ISBLANK(Formulaire!$B$1),\"\",Formulaire!$B$1)","v":"xxx"}]
["Prénom :",{"$f":"IF(ISBLANK(Formulaire!$B$2),\"\",Formulaire!$B$2)","v":"xxx"}]
[]
["Motif de non communication :"]
["Manque en place",null,null,"Indisponible"]
["Conservation",null,null,"Copie numérique"]
["Date",{"$f":"TODAY()","v":"2026-03-12"},null,"Localisation :",{"$f":"IF(ISBLANK(Formulaire!$E$12),\"\",Formulaire!$E$12)","v":""}]
["Demande de document 4-3"]
[]
["Cote : ",{"$f":"IF(ISBLANK(Formulaire!$D$12),\"\",Formulaire!$D$12)","v":""}]
[]
["Auteur: ",{"$f":"IF(ISBLANK(Formulaire!$B$12),\"\",Formulaire!$B$12)","v":""}]
["Titre :",{"$f":"IF(ISBLANK(Formulaire!$A$12),\"\",Formulaire!$A$12)","v":""}]
[]
["Date / tomaison :",{"$f":"IF(ISBLANK(Formulaire!$C$12),\"\",Formulaire!$C$12)","v":""}]
[]
["Lecteur",null,null,"Commentaire :"]
["Nom : ",{"$f":"IF(ISBLANK(Formulaire!$B$1),\"\",Formulaire!$B$1)","v":"xxx"}]
["Prénom :",{"$f":"IF(ISBLANK(Formulaire!$B$2),\"\",Formulaire!$B$2)","v":"xxx"}]
[]
["Motif de non communication :"]
[null,"Manque en place",null,"Indisponible"]
[null,"Conservation",null,"Copie numérique"]
["Date",{"$f":"TODAY()","v":"2026-03-12"},null,"Localisation :",{"$f":"IF(ISBLANK(Formulaire!$E$13),\"\",Formulaire!$E$13)","v":""}]
["Demande de document 5-1"]
[]
["Cote : ",{"$f":"IF(ISBLANK(Formulaire!$D$13),\"\",Formulaire!$D$13)","v":""}]
[]
["Auteur: ",{"$f":"IF(ISBLANK(Formulaire!$B$13),\"\",Formulaire!$B$13)","v":""}]
["Titre :",{"$f":"IF(ISBLANK(Formulaire!$A$13),\"\",Formulaire!$A$13)","v":""}]
[]
["Date / tomaison :",{"$f":"IF(ISBLANK(Formulaire!$C$13),\"\",Formulaire!$C$13)","v":""}]
[]
["Lecteur",null,null,"Commentaire :"]
["Nom : ",{"$f":"IF(ISBLANK(Formulaire!$B$1),\"\",Formulaire!$B$1)","v":"xxx"}]
["Prénom :",{"$f":"IF(ISBLANK(Formulaire!$B$2),\"\",Formulaire!$B$2)","v":"xxx"}]
[]
["Motif de non communication :"]
["Manque en place",null,null,"Indisponible"]
["Conservation",null,null,"Copie numérique"]
["Date",{"$f":"TODAY()","v":"2026-03-12"},null,"Localisation :",{"$f":"IF(ISBLANK(Formulaire!$E$13),\"\",Formulaire!$E$13)","v":""}]
["Demande de document 5-2"]
[]
["Cote : ",{"$f":"IF(ISBLANK(Formulaire!$D$13),\"\",Formulaire!$D$13)","v":""}]
[]
["Auteur: ",{"$f":"IF(ISBLANK(Formulaire!$B$13),\"\",Formulaire!$B$13)","v":""}]
["Titre :",{"$f":"IF(ISBLANK(Formulaire!$A$13),\"\",Formulaire!$A$13)","v":""}]
[]
["Date / tomaison :",{"$f":"IF(ISBLANK(Formulaire!$C$13),\"\",Formulaire!$C$13)","v":""}]
[]
["Lecteur",null,null,"Commentaire :"]
["Nom : ",{"$f":"IF(ISBLANK(Formulaire!$B$1),\"\",Formulaire!$B$1)","v":"xxx"}]
["Prénom :",{"$f":"IF(ISBLANK(Formulaire!$B$1),\"\",Formulaire!$B$1)","v":"xxx"}]
[]
["Motif de non communication :"]
["Manque en place",null,null,"Indisponible"]
["Conservation",null,null,"Copie numérique"]
["Date",{"$f":"TODAY()","v":"2026-03-12"},null,"Localisation :",{"$f":"IF(ISBLANK(Formulaire!$E$13),\"\",Formulaire!$E$13)","v":""}]
["Demande de document 5-3"]
[]
["Cote : ",{"$f":"IF(ISBLANK(Formulaire!$D$13),\"\",Formulaire!$D$13)","v":""}]
[]
["Auteur: ",{"$f":"IF(ISBLANK(Formulaire!$B$13),\"\",Formulaire!$B$13)","v":""}]
["Titre :",{"$f":"IF(ISBLANK(Formulaire!$A$13),\"\",Formulaire!$A$13)","v":""}]
[]
["Date / tomaison :",{"$f":"IF(ISBLANK(Formulaire!$C$13),\"\",Formulaire!$C$13)","v":""}]
[]
["Lecteur",null,null,"Commentaire :"]
["Nom : ",{"$f":"IF(ISBLANK(Formulaire!$B$1),\"\",Formulaire!$B$1)","v":"xxx"}]
["Prénom :",{"$f":"IF(ISBLANK(Formulaire!$B$2),\"\",Formulaire!$B$2)","v":"xxx"}]
[]
["Motif de non communication :"]
["Manque en place",null,null,"Indisponible"]
["Conservation",null,null,"Copie numérique"]
["Date :",{"$f":"TODAY()","v":"2026-03-12"},null,"Localisation :",{"$f":"IF(ISBLANK(Formulaire!$E$14),\"\",Formulaire!$E$14)","v":""}]
["Demande de document 6-1"]
[]
["Cote : ",{"$f":"IF(ISBLANK(Formulaire!$D$14),\"\",Formulaire!$D$14)","v":""}]
[]
["Auteur: ",{"$f":"IF(ISBLANK(Formulaire!$B$14),\"\",Formulaire!$B$14)","v":""}]
["Titre :",{"$f":"IF(ISBLANK(Formulaire!$A$14),\"\",Formulaire!$A$14)","v":""}]
[]
["Date / tomaison :",{"$f":"IF(ISBLANK(Formulaire!$C$14),\"\",Formulaire!$C$14)","v":""}]
[]
["Lecteur",null,null,"Commentaire :"]
["Nom : ",{"$f":"IF(ISBLANK(Formulaire!$B$1),\"\",Formulaire!$B$1)","v":"xxx"}]
["Prénom :",{"$f":"IF(ISBLANK(Formulaire!$B$2),\"\",Formulaire!$B$2)","v":"xxx"}]
[]
["Motif de non communication :"]
["Manque en place",null,null,"Indisponible"]
["Conservation",null,null,"Copie numérique"]
["Date",{"$f":"TODAY()","v":"2026-03-12"},null,"Localisation :",{"$f":"IF(ISBLANK(Formulaire!$E$14),\"\",Formulaire!$E$14)","v":""}]
["Demande de document 6-2"]
[]
["Cote : ",{"$f":"IF(ISBLANK(Formulaire!$D$14),\"\",Formulaire!$D$14)","v":""}]
[]
["Auteur: ",{"$f":"IF(ISBLANK(Formulaire!$B$14),\"\",Formulaire!$B$14)","v":""}]
["Titre :",{"$f":"IF(ISBLANK(Formulaire!$A$14),\"\",Formulaire!$A$14)","v":""}]
[]
["Date / tomaison :",{"$f":"IF(ISBLANK(Formulaire!$C$14),\"\",Formulaire!$C$14)","v":""}]
[]
["Lecteur",null,null,"Commentaire :"]
["Nom : ",{"$f":"IF(ISBLANK(Formulaire!$B$1),\"\",Formulaire!$B$1)","v":"xxx"}]
["Prénom :",{"$f":"IF(ISBLANK(Formulaire!$B$2),\"\",Formulaire!$B$2)","v":"xxx"}]
[]
["Motif de non communication :"]
["Manque en place",null,null,"Indisponible"]
["Conservation",null,null,"Copie numérique"]
["Date: ",{"$f":"TODAY()","v":"2026-03-12"},null,"Localisation :",{"$f":"IF(ISBLANK(Formulaire!$E$14),\"\",Formulaire!$E$14)","v":""}]
["Demande de document 6-3"]
[]
["Cote : ",{"$f":"IF(ISBLANK(Formulaire!$D$14),\"\",Formulaire!$D$14)","v":""}]
[]
["Auteur: ",{"$f":"IF(ISBLANK(Formulaire!$B$14),\"\",Formulaire!$B$14)","v":""}]
["Titre :",{"$f":"IF(ISBLANK(Formulaire!$A$14),\"\",Formulaire!$A$14)","v":""}]
[]
["Date / tomaison :",{"$f":"IF(ISBLANK(Formulaire!$C$14),\"\",Formulaire!$C$14)","v":""}]
[]
["Lecteur",null,null,"Commentaire :"]
["Nom : ",{"$f":"IF(ISBLANK(Formulaire!$B$1),\"\",Formulaire!$B$1)","v":"xxx"}]
["Prénom :",{"$f":"IF(ISBLANK(Formulaire!$B$2),\"\",Formulaire!$B$2)","v":"xxx"}]
[]
["Motif de non communication :"]
["Manque en place",null,null,"Indisponible"]
["Conservation",null,null,"Copie numérique"]
["Date",{"$f":"TODAY()","v":"2026-03-12"},null,"Localisation :",{"$f":"IF(ISBLANK(Formulaire!$E$15),\"\",Formulaire!$E$15)","v":""}]
["Demande de document 7-1"]
[]
["Cote : ",{"$f":"IF(ISBLANK(Formulaire!$D$15),\"\",Formulaire!$D$15)","v":""}]
[]
["Auteur: ",{"$f":"IF(ISBLANK(Formulaire!$B$15),\"\",Formulaire!$B$15)","v":""}]
["Titre :",{"$f":"IF(ISBLANK(Formulaire!$A$15),\"\",Formulaire!$A$15)","v":""}]
[]
["Date / tomaison :",{"$f":"IF(ISBLANK(Formulaire!$C$15),\"\",Formulaire!$C$15)","v":""}]
[]
["Lecteur",null,null,"Commentaire :"]
["Nom : ",{"$f":"IF(ISBLANK(Formulaire!$B$1),\"\",Formulaire!$B$1)","v":"xxx"}]
["Prénom :",{"$f":"IF(ISBLANK(Formulaire!$B$2),\"\",Formulaire!$B$2)","v":"xxx"}]
[]
["Motif de non communication :"]
["Manque en place",null,null,"Indisponible"]
["Conservation",null,null,"Copie numérique"]
["Date",{"$f":"TODAY()","v":"2026-03-12"},null,"Localisation :",{"$f":"IF(ISBLANK(Formulaire!$E$15),\"\",Formulaire!$E$15)","v":""}]
["Demande de document 7-2"]
[]
["Cote : ",{"$f":"IF(ISBLANK(Formulaire!$D$15),\"\",Formulaire!$D$15)","v":""}]
[]
["Auteur: ",{"$f":"IF(ISBLANK(Formulaire!$B$15),\"\",Formulaire!$B$15)","v":""}]
["Titre :",{"$f":"IF(ISBLANK(Formulaire!$A$15),\"\",Formulaire!$A$15)","v":""}]
[]
["Date / tomaison :",{"$f":"IF(ISBLANK(Formulaire!$C$15),\"\",Formulaire!$C$15)","v":""}]
[]
["Lecteur",null,null,"Commentaire :"]
["Nom : ",{"$f":"IF(ISBLANK(Formulaire!$B$1),\"\",Formulaire!$B$1)","v":"xxx"}]
["Prénom :",{"$f":"IF(ISBLANK(Formulaire!$B$2),\"\",Formulaire!$B$2)","v":"xxx"}]
[]
["Motif de non communication :"]
["Manque en place",null,null,"Indisponible"]
["Conservation",null,null,"Copie numérique"]
["Date :",{"$f":"TODAY()","v":"2026-03-12"},null,"Localisation :",{"$f":"IF(ISBLANK(Formulaire!$E$15),\"\",Formulaire!$E$15)","v":""}]
[null,null,"Demande de document 7-3"]
[]
["Cote : ",{"$f":"IF(ISBLANK(Formulaire!$D$15),\"\",Formulaire!$D$15)","v":""}]
[]
["Auteur: ",{"$f":"IF(ISBLANK(Formulaire!$B$15),\"\",Formulaire!$B$15)","v":""}]
["Titre :",{"$f":"IF(ISBLANK(Formulaire!$A$15),\"\",Formulaire!$A$15)","v":""}]
[]
["Date / tomaison :",{"$f":"IF(ISBLANK(Formulaire!$C$15),\"\",Formulaire!$C$15)","v":""}]
[]
["Lecteur",null,null,"Commentaire :"]
["Nom : ",{"$f":"IF(ISBLANK(Formulaire!$B$1),\"\",Formulaire!$B$1)","v":"xxx"}]
["Prénom :",{"$f":"IF(ISBLANK(Formulaire!$B$2),\"\",Formulaire!$B$2)","v":"xxx"}]
[]
["Motif de non communication :"]
[null,"Manque en place",null,"Indisponible"]
[null,"Conservation",null,"Copie numérique"]
["Date :",{"$f":"TODAY()","v":"2026-03-12"},null,"Localisation :",{"$f":"IF(ISBLANK(Formulaire!$E$16),\"\",Formulaire!$E$16)","v":""}]
["Demande de document 8-1"]
[]
["Cote : ",{"$f":"IF(ISBLANK(Formulaire!$D$16),\"\",Formulaire!$D$16)","v":""}]
[]
["Auteur: ",{"$f":"IF(ISBLANK(Formulaire!$B$16),\"\",Formulaire!$B$16)","v":""}]
["Titre :",{"$f":"IF(ISBLANK(Formulaire!$A$16),\"\",Formulaire!$A$16)","v":""}]
[]
["Date / tomaison :",{"$f":"IF(ISBLANK(Formulaire!$C$16),\"\",Formulaire!$C$16)","v":""}]
[]
["Lecteur",null,null,"Commentaire :"]
["Nom : ",{"$f":"IF(ISBLANK(Formulaire!$B$1),\"\",Formulaire!$B$1)","v":"xxx"}]
["Prénom :",{"$f":"IF(ISBLANK(Formulaire!$B$2),\"\",Formulaire!$B$2)","v":"xxx"}]
[]
["Motif de non communication :"]
["Manque en place",null,null,"Indisponible"]
["Conservation",null,null,"Copie numérique"]
["Date: ",{"$f":"TODAY()","v":"2026-03-12"},null,"Localisation :",{"$f":"IF(ISBLANK(Formulaire!$E$16),\"\",Formulaire!$E$16)","v":""}]
["Demande de document 8-2"]
[]
["Cote : ",{"$f":"IF(ISBLANK(Formulaire!$D$16),\"\",Formulaire!$D$16)","v":""}]
[]
["Auteur: ",{"$f":"IF(ISBLANK(Formulaire!$B$16),\"\",Formulaire!$B$16)","v":""}]
["Titre :",{"$f":"IF(ISBLANK(Formulaire!$A$16),\"\",Formulaire!$A$16)","v":""}]
[]
["Date / tomaison :",{"$f":"IF(ISBLANK(Formulaire!$C$16),\"\",Formulaire!$C$16)","v":""}]
[]
["Lecteur",null,null,"Commentaire :"]
["Nom : ",{"$f":"IF(ISBLANK(Formulaire!$B$1),\"\",Formulaire!$B$1)","v":"xxx"}]
["Prénom :",{"$f":"IF(ISBLANK(Formulaire!$B$2),\"\",Formulaire!$B$2)","v":"xxx"}]
[]
["Motif de non communication :"]
["Manque en place",null,null,"Indisponible"]
["Conservation",null,null,"Copie numérique"]
["Date : ",{"$f":"TODAY()","v":"2026-03-12"},null,"Localisation :",{"$f":"IF(ISBLANK(Formulaire!$E$16),\"\",Formulaire!$E$16)","v":""}]
["Demande de document 8-3"]
[]
["Cote : ",{"$f":"IF(ISBLANK(Formulaire!$D$16),\"\",Formulaire!$D$16)","v":""}]
[]
["Auteur: ",{"$f":"IF(ISBLANK(Formulaire!$B$16),\"\",Formulaire!$B$16)","v":""}]
["Titre :",{"$f":"IF(ISBLANK(Formulaire!$A$16),\"\",Formulaire!$A$16)","v":""}]
[]
["Date / tomaison :",{"$f":"IF(ISBLANK(Formulaire!$C$16),\"\",Formulaire!$C$16)","v":""}]
[]
["Lecteur",null,null,"Commentaire :"]
["Nom : ",{"$f":"IF(ISBLANK(Formulaire!$B$1),\"\",Formulaire!$B$1)","v":"xxx"}]
["Prénom :",{"$f":"IF(ISBLANK(Formulaire!$B$2),\"\",Formulaire!$B$2)","v":"xxx"}]
[]
["Motif de non communication :"]
[null,"Manque en place",null,"Indisponible"]
[null,"Conservation",null,"Copie numérique"]
["Date: ",{"$f":"TODAY()","v":"2026-03-12"},null,"Localisation :",{"$f":"IF(ISBLANK(Formulaire!$E$17),\"\",Formulaire!$E$17)","v":""}]
["Demande de document 9-1"]
[]
["Cote : ",{"$f":"IF(ISBLANK(Formulaire!$D$17),\"\",Formulaire!$D$17)","v":""}]
[]
["Auteur: ",{"$f":"IF(ISBLANK(Formulaire!$B$17),\"\",Formulaire!$B$17)","v":""}]
["Titre :",{"$f":"IF(ISBLANK(Formulaire!$A$17),\"\",Formulaire!$A$17)","v":""}]
[]
["Date / tomaison :",{"$f":"IF(ISBLANK(Formulaire!$C$17),\"\",Formulaire!$C$17)","v":""}]
[]
["Lecteur",null,null,"Commentaire :"]
["Nom : ",{"$f":"IF(ISBLANK(Formulaire!$B$1),\"\",Formulaire!$B$1)","v":"xxx"}]
["Prénom :",{"$f":"IF(ISBLANK(Formulaire!$B$2),\"\",Formulaire!$B$2)","v":"xxx"}]
[]
["Motif de non communication :"]
["Manque en place",null,null,"Indisponible"]
["Conservation",null,null,"Copie numérique"]
["Date: ",{"$f":"TODAY()","v":"2026-03-12"},null,"Localisation :",{"$f":"IF(ISBLANK(Formulaire!$E$17),\"\",Formulaire!$E$17)","v":""}]
["Demande de document 9-2"]
[]
["Cote : ",{"$f":"IF(ISBLANK(Formulaire!$D$17),\"\",Formulaire!$D$17)","v":""}]
[]
["Auteur: ",{"$f":"IF(ISBLANK(Formulaire!$B$17),\"\",Formulaire!$B$17)","v":""}]
["Titre :",{"$f":"IF(ISBLANK(Formulaire!$A$17),\"\",Formulaire!$A$17)","v":""}]
[]
["Date / tomaison :",{"$f":"IF(ISBLANK(Formulaire!$C$17),\"\",Formulaire!$C$17)","v":""}]
[]
["Lecteur",null,null,"Commentaire :"]
["Nom : ",{"$f":"IF(ISBLANK(Formulaire!$B$1),\"\",Formulaire!$B$1)","v":"xxx"}]
["Prénom :",{"$f":"IF(ISBLANK(Formulaire!$B$2),\"\",Formulaire!$B$2)","v":"xxx"}]
[]
["Motif de non communication :"]
["Manque en place",null,null,"Indisponible"]
["Conservation",null,null,"Copie numérique"]
["Date: ",{"$f":"TODAY()","v":"2026-03-12"},null,"Localisation :",{"$f":"IF(ISBLANK(Formulaire!$E$17),\"\",Formulaire!$E$17)","v":""}]
["Demande de document 9-3"]
[]
["Cote : ",{"$f":"IF(ISBLANK(Formulaire!$D$17),\"\",Formulaire!$D$17)","v":""}]
[]
["Auteur: ",{"$f":"IF(ISBLANK(Formulaire!$B$17),\"\",Formulaire!$B$17)","v":""}]
["Titre :",{"$f":"IF(ISBLANK(Formulaire!$A$17),\"\",Formulaire!$A$17)","v":""}]
[]
["Date / tomaison :",{"$f":"IF(ISBLANK(Formulaire!$C$17),\"\",Formulaire!$C$17)","v":""}]
[]
["Lecteur",null,null,"Commentaire :"]
["Nom : ",{"$f":"IF(ISBLANK(Formulaire!$B$1),\"\",Formulaire!$B$1)","v":"xxx"}]
["Prénom :",{"$f":"IF(ISBLANK(Formulaire!$B$2),\"\",Formulaire!$B$2)","v":"xxx"}]
[]
["Motif de non communication :"]
["Manque en place",null,null,"Indisponible"]
["Conservation",null,null,"Copie numérique"]
["Date: ",{"$f":"TODAY()","v":"2026-03-12"},null,"Localisation :",{"$f":"IF(ISBLANK(Formulaire!$E$18),\"\",Formulaire!$E$18)","v":""}]
["Demande de document 10-1"]
[]
["Cote : ",{"$f":"IF(ISBLANK(Formulaire!$D$18),\"\",Formulaire!$D$18)","v":""}]
[]
["Auteur: ",{"$f":"IF(ISBLANK(Formulaire!$B$18),\"\",Formulaire!$B$18)","v":""}]
["Titre :",{"$f":"IF(ISBLANK(Formulaire!$A$18),\"\",Formulaire!$A$18)","v":""}]
[]
["Date / tomaison :",{"$f":"IF(ISBLANK(Formulaire!$C$18),\"\",Formulaire!$C$18)","v":""}]
[]
["Lecteur",null,null,"Commentaire :"]
["Nom : ",{"$f":"IF(ISBLANK(Formulaire!$B$1),\"\",Formulaire!$B$1)","v":"xxx"}]
["Prénom :",{"$f":"IF(ISBLANK(Formulaire!$B$2),\"\",Formulaire!$B$2)","v":"xxx"}]
[]
["Motif de non communication :"]
["Manque en place",null,null,"Indisponible"]
["Conservation",null,null,"Copie numérique"]
["Date: ",{"$f":"TODAY()","v":"2026-03-12"},null,"Localisation :",{"$f":"IF(ISBLANK(Formulaire!$E$18),\"\",Formulaire!$E$18)","v":""}]
["Demande de document 10-2"]
[]
["Cote : ",{"$f":"IF(ISBLANK(Formulaire!$D$18),\"\",Formulaire!$D$18)","v":""}]
[]
["Auteur: ",{"$f":"IF(ISBLANK(Formulaire!$B$18),\"\",Formulaire!$B$18)","v":""}]
["Titre :",{"$f":"IF(ISBLANK(Formulaire!$A$18),\"\",Formulaire!$A$18)","v":""}]
[]
["Date / tomaison :",{"$f":"IF(ISBLANK(Formulaire!$C$18),\"\",Formulaire!$C$18)","v":""}]
[]
["Lecteur",null,null,"Commentaire :"]
["Nom : ",{"$f":"IF(ISBLANK(Formulaire!$B$1),\"\",Formulaire!$B$1)","v":"xxx"}]
["Prénom :",{"$f":"IF(ISBLANK(Formulaire!$B$2),\"\",Formulaire!$B$2)","v":"xxx"}]
[]
["Motif de non communication :"]
["Manque en place",null,null,"Indisponible"]
["Conservation",null,null,"Copie numérique"]
["Date: ",{"$f":"TODAY()","v":"2026-03-12"},null,"Localisation :",{"$f":"IF(ISBLANK(Formulaire!$E$18),\"\",Formulaire!$E$18)","v":""}]
["Demande de document 10-3"]
[]
["Cote : ",{"$f":"IF(ISBLANK(Formulaire!$D$18),\"\",Formulaire!$D$18)","v":""}]
[]
["Auteur: ",{"$f":"IF(ISBLANK(Formulaire!$B$18),\"\",Formulaire!$B$18)","v":""}]
["Titre :",{"$f":"IF(ISBLANK(Formulaire!$A$18),\"\",Formulaire!$A$18)","v":""}]
[]
["Date / tomaison :",{"$f":"IF(ISBLANK(Formulaire!$C$18),\"\",Formulaire!$C$18)","v":""}]
[]
["Lecteur",null,null,"Commentaire :"]
["Nom : ",{"$f":"IF(ISBLANK(Formulaire!$B$1),\"\",Formulaire!$B$1)","v":"xxx"}]
["Prénom :",{"$f":"IF(ISBLANK(Formulaire!$B$2),\"\",Formulaire!$B$2)","v":"xxx"}]
[]
["Motif de non communication :"]
["Manque en place",null,null,"Indisponible"]
["Conservation",null,null,"Copie numérique"]

{"sheet":"liste","index":2,"n_rows":9,"n_cols":1,"rows_kept":9}
["Salle de lecture"]
["Carmes"]
["Panthéon"]
["1er étage"]
["BSB 3"]
["BSB 4"]
["BSB 7"]
["BSG"]
["Malraux"]

{"sheet":"menu déroulant","index":3,"n_rows":8,"n_cols":1,"rows_kept":8,"hidden":true}
["Salle de lecture"]
["Carmes"]
["Panthéon"]
["1er étage"]
["BSG"]
["BSB"]
["Malraux"]
["Autres"]